tipologia proclamazione
type: ObjectProperty
comment: propreità utilizzata per descrivere la tipologia di proclamazione legata ad un mandato elettorale (per sostituzione, subentro, ...)
domain: mandatoCamera
range: proclamazione