riferimento al sistema elettorale
type: ObjectProperty
comment: questa proprietà collega ogni legislatura ad un sistema elettorale
domain: Class
  union of: legislatura
  union of: elezione
domain: Class
  union of: legislatura
  union of: elezione
domain: Class
  union of: legislatura
  union of: elezione
domain: Class
  union of: legislatura
  union of: elezione
domain: Class
  union of: elezione
  union of: legislatura
domain: Class
  union of: legislatura
  union of: elezione
range: sistemaElettorale