riferimento al senatore
domain: Class
  union of: mandatoSenato
  union of: ufficioParlamentare
domain: Class
  union of: mandatoSenato
  union of: ufficioParlamentare
domain: Class
  union of: mandatoSenato
  union of: ufficioParlamentare
comment: proprietà utilizzata all'interno degli incarichi di governo per puntare all'organo di governo
type: ObjectProperty
domain: Class
  union of: mandatoSenato
  union of: ufficioParlamentare
domain: Class
  union of: mandatoSenato
  union of: ufficioParlamentare
domain: Class
  union of: mandatoSenato
  union of: ufficioParlamentare
range: senatore