riferimento a mandato camera
type: ObjectProperty
comment: serve a collegare il deputato al mandato elettorale
domain: Class
  union of: ocd:deputato
  union of: ocd:persona
domain: Class
  union of: ocd:deputato
  union of: ocd:persona
domain: Class
  union of: ocd:deputato
  union of: ocd:persona
domain: Class
  union of: ocd:deputato
  union of: ocd:persona
domain: Class
  union of: ocd:deputato
  union of: ocd:persona
domain: Class
  union of: ocd:deputato
  union of: ocd:persona
range: mandatoCamera