primo firmatario
comment: indica il primo firmatario del documento
range: persona
domain: Class
  union of: atto
  union of: DOC
domain: Class
  union of: atto
  union of: DOC
range: Class
  union of: deputato
  union of: membroGoverno
range: Class
  union of: deputato
  union of: membroGoverno
domain: Class
  union of: atto
  union of: DOC
range: Class
  union of: deputato
  union of: membroGoverno
domain: Class
  union of: atto
  union of: DOC
domain: Class
  union of: DOC
  union of: aic
domain: Class
  union of: atto
  union of: DOC
range: Class
  union of: deputato
  union of: membroGoverno
range: Class
  union of: deputato
  union of: membroGoverno
type: ObjectProperty