ADM2
type: DatatypeProperty
comment: secondo livello di divisione amministrativa
domain: luogo
range: string
sub property of: topDataProperty
sub property of: parentADM2
equivalent property: parentADM2