dossier
type: Class
comment: la classe contiene i dossier di documentazione, analisi e materiali predisposti dai Servizi di documentazione della Camera a supporto dell'attività parlamentare
subclass of: documenti