circoscrizioni per plurieletti
type: Class
comment: questa classe è stata creata per gestire la descrizione di tutte le circoscrizione dei plurieletti
subclass of: Restriction
  on property: coverage
  some values from: Literal
subclass of: Restriction
  all values from: Literal
  on property: coverage
subclass of: Restriction
  on property: coverage
  some values from: Literal
subclass of: Restriction
  all values from: Literal
  on property: coverage
subclass of: Restriction
  all values from: Literal
  on property: coverage
subclass of: Restriction
  on property: coverage
  some values from: Literal