Il procedimento di revisione della Costituzione
type: Concept
modified: 2016-05-12T12:13:59Z
references: 138
broader: http://dati.camera.it/ocd/bpr/ccd.rdf/C0000000056
definition: Potere costituente, strumenti e procedure per l'approvazione di leggi costituzionali e di revisione della Costituzione. Comprende contributi sull'istituzione e l'attività delle varie commissioni bicamerali per le riforme istituzionali. Sono esclusi studi relativi al merito di specifiche proposte di modifica costituzionale. Se tali proposte riguardano in generale il Parlamento vedi A10. Se riguardano singoli istituti (ad es. commissioni d'inchiesta o procedimento legislativo) vedi le classi corrispondenti. Per il Parlamento regio comprende i contributi relativi alla "rigidità" dello Statuto albertino e alle modificazioni tacite ad opera del Parlamento, nonché la tematica delle "leggi costituzionali" dopo la riforma fascista istitutiva del Gran consiglio del fascismo.
in scheme: http://dati.camera.it/ocd/bpr/ccd.rdf/C0000000000
notation: D40