Crisi della legge, inflazione e razionalizzazione normativa, delegificazione
type: Concept
modified: 2016-05-12T12:13:58Z
broader: http://dati.camera.it/ocd/bpr/ccd.rdf/C0000000056
definition: Comprende i profili generali relativi alla codificazione e ai testi unici
in scheme: http://dati.camera.it/ocd/bpr/ccd.rdf/C0000000000
notation: D50