atti di indirizzo e controllo
type: Class
comment: è la classe che descrive le interrogazioni, domande che i parlamentari rivolgono al Governo per avere informazioni su fatti specifici e le interpellanze, domande che sollecitano chiarimenti sui motivi dell’azione politica del Governo
subclass of: lavori